Target
Somatostatin receptor type 3
Ligand
BDBM50059089
Substrate
Meas. Tech.
ChEMBL_200510 (CHEMBL803854)
IC50
>1000±n/a nM
Citation
 Osapay, GProkai, LKim, HSMedzihradszky, KFCoy, DHLiapakis, GReisine, TMelacini, GZhu, QWang, SHMattern, RHGoodman, M Lanthionine-somatostatin analogs: synthesis, characterization, biological activity, and enzymatic stability studies. J Med Chem 40:2241-51 (1997)  
Target
Name:
Somatostatin receptor type 3
Synonyms:
SOMATOSTATIN SST3 SSR-28 Smstr3 Somatostatin receptor 3 Sstr3
Type:
Enzyme Catalytic Domain
Mol. Mass.:
47225.49
Organism:
MOUSE
Description:
SOMATOSTATIN SST3 SSTR3 MOUSE::P30935
Residue:
428
  
Inhibitor
Name:
BDBM50059089
Synonyms:
9-(4-Amino-butyl)-18-(2-amino-3-phenyl-propionylamino)-15-benzyl-6-(1-hydroxy-ethyl)-12-(1H-indol-3-ylmethyl)-5,8,11,14,17-pentaoxo-1-thia-4,7,10,13,16-pentaaza-cyclononadecane-3-carboxylic acid (1-carbamoyl-2-hydroxy-propyl)-amide | CHEMBL436783
Type:
Small organic molecule
Emp. Form.:
C49H65N11O10S
Mol. Mass.:
1000.173
SMILES:
C[C@@H](O)[C@H](NC(=O)[C@@H]1CSC[C@@H](NC(=O)[C@H](N)Cc2ccccc2)C(=O)N[C@H](Cc2ccccc2)C(=O)N[C@@H](Cc2c[nH]c3ccccc23)C(=O)N[C@H](CCCCN)C(=O)N[C@@H]([C@@H](C)O)C(=O)N1)C(N)=O
: