Target
Translocator protein
Ligand
BDBM50059756
Substrate
Meas. Tech.
ChEMBL_37036 (CHEMBL650832)
IC50
8.8±n/a nM
Citation
 Cappelli, AAnzini, MVomero, SDe Benedetti, PGMenziani, MCGiorgi, GManzoni, C Mapping the peripheral benzodiazepine receptor binding site by conformationally restrained derivatives of 1-(2-chlorophenyl)-N-methyl-N-(1-methylpropyl)-3- isoquinolinecarboxamide (PK11195). J Med Chem 40:2910-21 (1997)  
Target
Name:
Translocator protein
Synonyms:
Benzodiazepine receptors; peripheral & central Mbr PBR Peripheral benzodiazepine receptor (PBR) TSPO_RAT | Tspo
Type:
Mitochondrion membrane protein
Mol. Mass.:
18945.84
Organism:
Rattus norvegicus (rat)
Description:
Competitive binding experiments were performed on rat kidney mitochondrial membranes.
Residue:
169
  
Inhibitor
Name:
BDBM50059756
Synonyms:
3-Methyl-4-phenyl-quinoline-2-carboxylic acid (4-methoxy-phenyl)-methyl-amide | CHEMBL14956
Type:
Small organic molecule
Emp. Form.:
C25H22N2O2
Mol. Mass.:
382.4544
SMILES:
COc1ccc(cc1)N(C)C(=O)c1nc2ccccc2c(c1C)-c1ccccc1
: