Target
Cannabinoid receptor 1
Ligand
BDBM50060616
Substrate
Meas. Tech.
ChEMBL_46613 (CHEMBL875534)
Ki
24±n/a nM
Citation
 Ryan, WJBanner, WKWiley, JLMartin, BRRazdan, RK Potent anandamide analogs: the effect of changing the length and branching of the end pentyl chain. J Med Chem 40:3617-25 (1997)  
Target
Name:
Cannabinoid receptor 1
Synonyms:
Brain-type cannabinoid receptor CB-R CNR1_MOUSE Cannabinoid receptor | Cnr1
Type:
Enzyme
Mol. Mass.:
52842.52
Organism:
Mus musculus (Mouse)
Description:
P47746
Residue:
473
  
Inhibitor
Name:
BDBM50060616
Synonyms:
(5Z,8Z,11Z,14Z)-Henicosa-5,8,11,14-tetraenoic acid (2-hydroxy-ethyl)-amide | CHEMBL121011
Type:
Small organic molecule
Emp. Form.:
C23H39NO2
Mol. Mass.:
361.5613
SMILES:
CCCCCC\C=C/C\C=C/C\C=C/C\C=C/CCCC(=O)NCCO
: