Target
Sodium-dependent dopamine transporter
Ligand
BDBM50454757
Substrate
Meas. Tech.
ChEMBL_62488 (CHEMBL677380)
Ki
1560±n/a nM
Citation
 Lomenzo, SAIzenwasser, SKatz, JLTerry, PDZhu, NKlein, CLTrudell, ML Synthesis, structure, dopamine transporter affinity, and dopamine uptake inhibition of 6-alkyl-3-benzyl-2-[(methoxycarbonyl)methyl]tropane derivatives. J Med Chem 40:4406-14 (1998)  
Target
Name:
Sodium-dependent dopamine transporter
Synonyms:
DA transporter SC6A3_RAT Sodium-dependent dopamine transporter | Sodium-dependent dopamine transporter (DAT)
Type:
Multi-pass membrane protein
Mol. Mass.:
68749.45
Organism:
Rattus norvegicus (rat)
Description:
P23977
Residue:
619
  
Inhibitor
Name:
BDBM50454757
Synonyms:
CHEMBL336186
Type:
Small organic molecule
Emp. Form.:
C25H31NO2
Mol. Mass.:
377.5191
SMILES:
COC(=O)C[C@@H]1C2C[C@H](Cc3ccccc3)C(C[C@@H]1Cc1ccccc1)N2C
: