Target
Sodium-dependent dopamine transporter
Ligand
BDBM50061958
Substrate
Meas. Tech.
ChEMBL_62488 (CHEMBL677380)
Ki
4108±n/a nM
Citation
 Lomenzo, SAIzenwasser, SKatz, JLTerry, PDZhu, NKlein, CLTrudell, ML Synthesis, structure, dopamine transporter affinity, and dopamine uptake inhibition of 6-alkyl-3-benzyl-2-[(methoxycarbonyl)methyl]tropane derivatives. J Med Chem 40:4406-14 (1998)  
Target
Name:
Sodium-dependent dopamine transporter
Synonyms:
DA transporter SC6A3_RAT Sodium-dependent dopamine transporter | Sodium-dependent dopamine transporter (DAT)
Type:
Multi-pass membrane protein
Mol. Mass.:
68749.45
Organism:
Rattus norvegicus (rat)
Description:
P23977
Residue:
619
  
Inhibitor
Name:
BDBM50061958
Synonyms:
(3-Benzyl-6-ethyl-8-methyl-8-aza-bicyclo[3.2.1]oct-2-yl)-acetic acid methyl ester | CHEMBL3085522
Type:
Small organic molecule
Emp. Form.:
C21H31NO2
Mol. Mass.:
329.4763
SMILES:
CCC[C@@H]1CC2[C@H](CC(=O)OC)[C@@H](Cc3ccccc3)CC1N2C
: