Target
Sodium-dependent dopamine transporter
Ligand
BDBM50366564
Substrate
Meas. Tech.
ChEMBL_61850 (CHEMBL670037)
IC50
314±n/a nM
Citation
 Lomenzo, SAIzenwasser, SKatz, JLTerry, PDZhu, NKlein, CLTrudell, ML Synthesis, structure, dopamine transporter affinity, and dopamine uptake inhibition of 6-alkyl-3-benzyl-2-[(methoxycarbonyl)methyl]tropane derivatives. J Med Chem 40:4406-14 (1998)  
Target
Name:
Sodium-dependent dopamine transporter
Synonyms:
DA transporter SC6A3_RAT Sodium-dependent dopamine transporter | Sodium-dependent dopamine transporter (DAT)
Type:
Multi-pass membrane protein
Mol. Mass.:
68749.45
Organism:
Rattus norvegicus (rat)
Description:
P23977
Residue:
619
  
Inhibitor
Name:
BDBM50366564
Synonyms:
CHEMBL1790051 WIN-35065-2
Type:
Small organic molecule
Emp. Form.:
C16H21NO2
Mol. Mass.:
259.3434
SMILES:
COC(=O)[C@@H]1C2CC[C@H](C[C@@H]1c1ccccc1)N2C
: