Target
Sodium-dependent dopamine transporter
Ligand
BDBM50061952
Substrate
Meas. Tech.
ChEMBL_62488 (CHEMBL677380)
Ki
4830±n/a nM
Citation
 Lomenzo, SAIzenwasser, SKatz, JLTerry, PDZhu, NKlein, CLTrudell, ML Synthesis, structure, dopamine transporter affinity, and dopamine uptake inhibition of 6-alkyl-3-benzyl-2-[(methoxycarbonyl)methyl]tropane derivatives. J Med Chem 40:4406-14 (1998)  
Target
Name:
Sodium-dependent dopamine transporter
Synonyms:
DA transporter SC6A3_RAT Sodium-dependent dopamine transporter | Sodium-dependent dopamine transporter (DAT)
Type:
Multi-pass membrane protein
Mol. Mass.:
68749.45
Organism:
Rattus norvegicus (rat)
Description:
P23977
Residue:
619
  
Inhibitor
Name:
BDBM50061952
Synonyms:
(3,6-Dibenzyl-8-methyl-8-aza-bicyclo[3.2.1]oct-2-en-2-yl)-acetic acid methyl ester; hydrochloride | CHEMBL542492
Type:
Small organic molecule
Emp. Form.:
C25H29NO2
Mol. Mass.:
375.5033
SMILES:
COC(=O)CC1=C(Cc2ccccc2)CC2C(Cc3ccccc3)CC1N2C
: