Target
5-hydroxytryptamine receptor 4
Ligand
BDBM50056399
Substrate
Meas. Tech.
ChEMBL_3253 (CHEMBL619759)
IC50
30±n/a nM
Citation
 Yang, DSoulier, JLSicsic, SMathé-Allainmat, MBrémont, BCroci, TCardamone, RAureggi, GLanglois, M New esters of 4-amino-5-chloro-2-methoxybenzoic acid as potent agonists and antagonists for 5-HT4 receptors. J Med Chem 40:608-21 (1997)  
Target
Name:
5-hydroxytryptamine receptor 4
Synonyms:
5-HT4 5HT4R_CAVPO Serotonin 4 (5-HT4) receptor
Type:
Enzyme Catalytic Domain
Mol. Mass.:
43735.29
Organism:
GUINEA PIG
Description:
5-HT4 HTR4 GUINEA PIG::O70528
Residue:
388
  
Inhibitor
Name:
BDBM50056399
Synonyms:
4-Amino-5-chloro-2-methoxy-benzoic acid (R)-(1-aza-bicyclo[2.2.2]oct-3-yl) ester | CHEMBL41769
Type:
Small organic molecule
Emp. Form.:
C15H19ClN2O3
Mol. Mass.:
310.776
SMILES:
COc1cc(N)c(Cl)cc1C(=O)O[C@H]1CN2CCC1CC2
: