Target
5-hydroxytryptamine receptor 4
Ligand
BDBM10755
Substrate
Meas. Tech.
ChEMBL_3340 (CHEMBL619040)
Ki
187±n/a nM
Citation
 Yang, DSoulier, JLSicsic, SMathé-Allainmat, MBrémont, BCroci, TCardamone, RAureggi, GLanglois, M New esters of 4-amino-5-chloro-2-methoxybenzoic acid as potent agonists and antagonists for 5-HT4 receptors. J Med Chem 40:608-21 (1997)  
Target
Name:
5-hydroxytryptamine receptor 4
Synonyms:
5-HT-4 5-HT4L 5-hydroxytryptamine receptor 4 Htr4 Serotonin 4 (5-HT4) receptor
Type:
Enzyme Catalytic Domain
Mol. Mass.:
46117.31
Organism:
RAT
Description:
5-HT4 HTR4 RAT::Q62758
Residue:
406
  
Inhibitor
Name:
BDBM10755
Synonyms:
14C-5-hydroxy tryptamine creatinine disulfate 5-HT 5-hydroxy tryptamine creatinine disulfate Serotonin | [3H]-5-HT
Type:
Small organic molecule
Emp. Form.:
C10H12N2O
Mol. Mass.:
176.2151
SMILES:
NCCc1c[nH]c2ccc(O)cc12
: