Target
5-hydroxytryptamine receptor 4
Ligand
BDBM50056417
Substrate
Meas. Tech.
ChEMBL_3340 (CHEMBL619040)
Ki
103±n/a nM
Citation
 Yang, DSoulier, JLSicsic, SMathé-Allainmat, MBrémont, BCroci, TCardamone, RAureggi, GLanglois, M New esters of 4-amino-5-chloro-2-methoxybenzoic acid as potent agonists and antagonists for 5-HT4 receptors. J Med Chem 40:608-21 (1997)  
Target
Name:
5-hydroxytryptamine receptor 4
Synonyms:
5-HT-4 5-HT4L 5-hydroxytryptamine receptor 4 Htr4 Serotonin 4 (5-HT4) receptor
Type:
Enzyme Catalytic Domain
Mol. Mass.:
46117.31
Organism:
RAT
Description:
5-HT4 HTR4 RAT::Q62758
Residue:
406
  
Inhibitor
Name:
BDBM50056417
Synonyms:
4-Amino-5-chloro-N-[2-(3,5-dimethyl-piperidin-1-yl)-ethyl]-2-methoxy-benzamide | CHEMBL351557
Type:
Small organic molecule
Emp. Form.:
C17H26ClN3O2
Mol. Mass.:
339.86
SMILES:
COc1cc(N)c(Cl)cc1C(=O)NCCN1CC(C)CC(C)C1
: