Target
5-hydroxytryptamine receptor 3A/3B
Ligand
BDBM50056403
Substrate
Meas. Tech.
ChEMBL_2980 (CHEMBL621307)
Ki
>1000±n/a nM
Citation
 Yang, DSoulier, JLSicsic, SMathé-Allainmat, MBrémont, BCroci, TCardamone, RAureggi, GLanglois, M New esters of 4-amino-5-chloro-2-methoxybenzoic acid as potent agonists and antagonists for 5-HT4 receptors. J Med Chem 40:608-21 (1997)  
Target
Name:
5-hydroxytryptamine receptor 3A/3B
Synonyms:
Serotonin 3 (5-HT3) receptor | Serotonin 3a (5-HT3a)/3b (5-HT3b) receptor
Type:
Mol. Mass.:
Description:
ASSAY_ID of EBI is 2974
Components:
This complex has 2 components.
Component 1
Name:
5-hydroxytryptamine receptor 3B
Synonyms:
5HT3B_RAT Serotonin (5-HT) receptor
Type:
PROTEIN
Mol. Mass.:
50328.78
Organism:
Rattus norvegicus
Description:
EBI_11885
Residue:
437
  
Component 2
Name:
5-hydroxytryptamine receptor 3A
Synonyms:
5-HT3 5HT3A_RAT Htr3 Serotonin (5-HT) receptor | Zacopride site-R
Type:
Enzyme Catalytic Domain
Mol. Mass.:
55428.70
Organism:
RAT
Description:
5-HT3 HTR3A RAT::P35563
Residue:
483
  
Inhibitor
Name:
BDBM50056403
Synonyms:
4-Amino-5-chloro-2-methoxy-benzoic acid 2-(3-hydroxy-piperidin-1-yl)-ethyl ester | CHEMBL157880
Type:
Small organic molecule
Emp. Form.:
C15H21ClN2O4
Mol. Mass.:
328.791
SMILES:
COc1cc(N)c(Cl)cc1C(=O)OCCN1CCCC(O)C1
: