Target
Cholecystokinin receptor type A
Ligand
BDBM50056448
Substrate
Meas. Tech.
ChEMBL_49725 (CHEMBL661967)
Ki
2472±n/a nM
Citation
 Blommaert, AGDhôtel, HDucos, BDurieux, CGoudreau, NBado, AGarbay, CRoques, BP Structure-based design of new constrained cyclic agonists of the cholecystokinin CCK-B receptor. J Med Chem 40:647-58 (1997)  
Target
Name:
Cholecystokinin receptor type A
Synonyms:
CCK-A receptor CCK1-R CCKAR_CAVPO Cholecystokinin receptor type A | Cholecystokinin-1 receptor
Type:
Mol. Mass.:
48229.77
Organism:
Cavia porcellus
Description:
Residue:
430
  
Inhibitor
Name:
BDBM50056448
Synonyms:
CHEMBL2371221 | N-(1-Carbamoyl-2-phenyl-ethyl)-3-{[(2R,5R)-2-(1H-indol-3-ylmethyl)-2-methyl-3,14-dioxo-1,4diaza-cyclotetradecane-5-carbonyl]-amino}-succinamic acid
Type:
Small organic molecule
Emp. Form.:
C36H46N6O7
Mol. Mass.:
674.7864
SMILES:
C[C@]1(Cc2c[nH]c3ccccc23)NC(=O)CCCCCCCC[C@@H](NC1=O)C(=O)N[C@@H](CC(O)=O)C(=O)N[C@@H](Cc1ccccc1)C(N)=O
: