Target
Gastrin/cholecystokinin type B receptor
Ligand
BDBM50056448
Substrate
Meas. Tech.
ChEMBL_48440 (CHEMBL662105)
EC50
4±n/a nM
Citation
 Blommaert, AGDhôtel, HDucos, BDurieux, CGoudreau, NBado, AGarbay, CRoques, BP Structure-based design of new constrained cyclic agonists of the cholecystokinin CCK-B receptor. J Med Chem 40:647-58 (1997)  
Target
Name:
Gastrin/cholecystokinin type B receptor
Synonyms:
Cckbr Cholecystokinin B receptor GASR_RAT | Gastrin/cholecystokinin type B receptor
Type:
Enzyme Catalytic Domain
Mol. Mass.:
48980.43
Organism:
RAT
Description:
Cholecystokinin A CCKBR RAT::P30553
Residue:
452
  
Inhibitor
Name:
BDBM50056448
Synonyms:
CHEMBL2371221 | N-(1-Carbamoyl-2-phenyl-ethyl)-3-{[(2R,5R)-2-(1H-indol-3-ylmethyl)-2-methyl-3,14-dioxo-1,4diaza-cyclotetradecane-5-carbonyl]-amino}-succinamic acid
Type:
Small organic molecule
Emp. Form.:
C36H46N6O7
Mol. Mass.:
674.7864
SMILES:
C[C@]1(Cc2c[nH]c3ccccc23)NC(=O)CCCCCCCC[C@@H](NC1=O)C(=O)N[C@@H](CC(O)=O)C(=O)N[C@@H](Cc1ccccc1)C(N)=O
: