Target
Delta-type opioid receptor
Ligand
BDBM50056543
Substrate
Meas. Tech.
ChEMBL_146769 (CHEMBL755213)
IC50
9.2±n/a nM
Citation
 Calderon, SNRice, KCRothman, RBPorreca, FFlippen-Anderson, JLKayakiri, HXu, HBecketts, KSmith, LEBilsky, EJDavis, PHorvath, R Probes for narcotic receptor mediated phenomena. 23. Synthesis, opioid receptor binding, and bioassay of the highly selective delta agonist (+)-4-[(alpha R)-alpha-((2S,5R)-4-Allyl-2,5-dimethyl-1-piperazinyl)-3-methoxybenzyl]- N,N-diethylbenzamide (SNC 80) and related novel nonpeptide delta opioid r J Med Chem 40:695-704 (1997)  
Target
Name:
Delta-type opioid receptor
Synonyms:
Cytochrome P450 3A4 Delta opioid receptor Delta-type opioid receptor (DOR) OPRD_RAT Opioid receptor Opioid receptors; mu & delta Ror-a | Voltage-gated potassium channel
Type:
G Protein-Coupled Receptor (GPCR)
Mol. Mass.:
40465.04
Organism:
Rattus norvegicus (rat)
Description:
Competition binding assays were using CHO-K1 cell membranes expressing the opioid receptor.
Residue:
372
  
Inhibitor
Name:
BDBM50056543
Synonyms:
4-[((1R,2S,5R)-4-Allyl-2,5-dimethyl-piperazin-1-yl)-phenyl-methyl]-N,N-diethyl-benzamide 4-[(S)-((2S,5R)-4-Allyl-2,5-dimethyl-piperazin-1-yl)-phenyl-methyl]-N,N-diethyl-benzamide | CHEMBL153648
Type:
Small organic molecule
Emp. Form.:
C27H37N3O
Mol. Mass.:
419.6022
SMILES:
CCN(CC)C(=O)c1ccc(cc1)C(N1C[C@@H](C)N(CC=C)C[C@@H]1C)c1ccccc1
: