Target
Mu-type opioid receptor
Ligand
BDBM50039026
Substrate
Meas. Tech.
ChEMBL_148690 (CHEMBL857686)
IC50
2322±n/a nM
Citation
 Calderon, SNRice, KCRothman, RBPorreca, FFlippen-Anderson, JLKayakiri, HXu, HBecketts, KSmith, LEBilsky, EJDavis, PHorvath, R Probes for narcotic receptor mediated phenomena. 23. Synthesis, opioid receptor binding, and bioassay of the highly selective delta agonist (+)-4-[(alpha R)-alpha-((2S,5R)-4-Allyl-2,5-dimethyl-1-piperazinyl)-3-methoxybenzyl]- N,N-diethylbenzamide (SNC 80) and related novel nonpeptide delta opioid r J Med Chem 40:695-704 (1997)  
Target
Name:
Mu-type opioid receptor
Synonyms:
MOR-1 Mu-type opioid receptor (MOR) OPRM_RAT Opioid receptor B Ror-b
Type:
G Protein-Coupled Receptor (GPCR)
Mol. Mass.:
44503.11
Organism:
Rattus norvegicus (rat)
Description:
Competition binding assays were carried out using membrane preparations from transfected HN9.10 cells that constitutively expressed the mu opioid receptor.
Residue:
398
  
Inhibitor
Name:
BDBM50039026
Synonyms:
4-((R)-((2S,5R)-4-allyl-2,5-dimethylpiperazin-1-yl)(3-hydroxyphenyl)methyl)-N,N-diethylbenzamide 4-[(4-Allyl-2,5-dimethyl-piperazin-1-yl)-(3-hydroxy-phenyl)-methyl]-N,N-diethyl-benzamide(SNC-86) BW-373U86 SNC-86
Type:
Small organic molecule
Emp. Form.:
C27H37N3O2
Mol. Mass.:
435.6016
SMILES:
CCN(CC)C(=O)c1ccc(cc1)[C@@H](N1C[C@@H](C)N(CC=C)C[C@@H]1C)c1cccc(O)c1
: