Target
Mu-type opioid receptor
Ligand
BDBM50056544
Substrate
Meas. Tech.
ChEMBL_146976 (CHEMBL757515)
IC50
>3000±n/a nM
Citation
 Calderon, SNRice, KCRothman, RBPorreca, FFlippen-Anderson, JLKayakiri, HXu, HBecketts, KSmith, LEBilsky, EJDavis, PHorvath, R Probes for narcotic receptor mediated phenomena. 23. Synthesis, opioid receptor binding, and bioassay of the highly selective delta agonist (+)-4-[(alpha R)-alpha-((2S,5R)-4-Allyl-2,5-dimethyl-1-piperazinyl)-3-methoxybenzyl]- N,N-diethylbenzamide (SNC 80) and related novel nonpeptide delta opioid r J Med Chem 40:695-704 (1997)  
Target
Name:
Mu-type opioid receptor
Synonyms:
M-OR-1 Mu opioid receptor OPIATE Mu OPRM_CAVPO
Type:
Enzyme Catalytic Domain
Mol. Mass.:
11165.58
Organism:
GUINEA PIG
Description:
P97266
Residue:
98
  
Inhibitor
Name:
BDBM50056544
Synonyms:
4-[(R)-((2S,5R)-4-Allyl-2,5-dimethyl-piperazin-1-yl)-(3-iodo-phenyl)-methyl]-N,N-diethyl-benzamide | CHEMBL347712
Type:
Small organic molecule
Emp. Form.:
C27H36IN3O
Mol. Mass.:
545.4987
SMILES:
CCN(CC)C(=O)c1ccc(cc1)[C@@H](N1C[C@@H](C)N(CC=C)C[C@@H]1C)c1cccc(I)c1
: