Target
Delta-type opioid receptor
Ligand
BDBM50056543
Substrate
Meas. Tech.
ChEMBL_145763 (CHEMBL752781)
IC50
11±n/a nM
Citation
 Calderon, SNRice, KCRothman, RBPorreca, FFlippen-Anderson, JLKayakiri, HXu, HBecketts, KSmith, LEBilsky, EJDavis, PHorvath, R Probes for narcotic receptor mediated phenomena. 23. Synthesis, opioid receptor binding, and bioassay of the highly selective delta agonist (+)-4-[(alpha R)-alpha-((2S,5R)-4-Allyl-2,5-dimethyl-1-piperazinyl)-3-methoxybenzyl]- N,N-diethylbenzamide (SNC 80) and related novel nonpeptide delta opioid r J Med Chem 40:695-704 (1997)  
Target
Name:
Delta-type opioid receptor
Synonyms:
DOR-1 MSL-2 OPRD_MOUSE Oprd1
Type:
Enzyme Catalytic Domain
Mol. Mass.:
40577.25
Organism:
MOUSE
Description:
P32300
Residue:
372
  
Inhibitor
Name:
BDBM50056543
Synonyms:
4-[((1R,2S,5R)-4-Allyl-2,5-dimethyl-piperazin-1-yl)-phenyl-methyl]-N,N-diethyl-benzamide 4-[(S)-((2S,5R)-4-Allyl-2,5-dimethyl-piperazin-1-yl)-phenyl-methyl]-N,N-diethyl-benzamide | CHEMBL153648
Type:
Small organic molecule
Emp. Form.:
C27H37N3O
Mol. Mass.:
419.6022
SMILES:
CCN(CC)C(=O)c1ccc(cc1)C(N1C[C@@H](C)N(CC=C)C[C@@H]1C)c1ccccc1
: