Target
Mu-type opioid receptor
Ligand
BDBM50056543
Substrate
Meas. Tech.
ChEMBL_148690 (CHEMBL857686)
IC50
>2500±n/a nM
Citation
 Calderon, SNRice, KCRothman, RBPorreca, FFlippen-Anderson, JLKayakiri, HXu, HBecketts, KSmith, LEBilsky, EJDavis, PHorvath, R Probes for narcotic receptor mediated phenomena. 23. Synthesis, opioid receptor binding, and bioassay of the highly selective delta agonist (+)-4-[(alpha R)-alpha-((2S,5R)-4-Allyl-2,5-dimethyl-1-piperazinyl)-3-methoxybenzyl]- N,N-diethylbenzamide (SNC 80) and related novel nonpeptide delta opioid r J Med Chem 40:695-704 (1997)  
Target
Name:
Mu-type opioid receptor
Synonyms:
MOR-1 Mu-type opioid receptor (MOR) OPRM_RAT Opioid receptor B Ror-b
Type:
G Protein-Coupled Receptor (GPCR)
Mol. Mass.:
44503.11
Organism:
Rattus norvegicus (rat)
Description:
Competition binding assays were carried out using membrane preparations from transfected HN9.10 cells that constitutively expressed the mu opioid receptor.
Residue:
398
  
Inhibitor
Name:
BDBM50056543
Synonyms:
4-[((1R,2S,5R)-4-Allyl-2,5-dimethyl-piperazin-1-yl)-phenyl-methyl]-N,N-diethyl-benzamide 4-[(S)-((2S,5R)-4-Allyl-2,5-dimethyl-piperazin-1-yl)-phenyl-methyl]-N,N-diethyl-benzamide | CHEMBL153648
Type:
Small organic molecule
Emp. Form.:
C27H37N3O
Mol. Mass.:
419.6022
SMILES:
CCN(CC)C(=O)c1ccc(cc1)C(N1C[C@@H](C)N(CC=C)C[C@@H]1C)c1ccccc1
: