Target
Sodium-dependent dopamine transporter
Ligand
BDBM50454828
Substrate
Meas. Tech.
ChEMBL_62499 (CHEMBL677556)
Ki
69±n/a nM
Citation
 Kline, RHIzenwasser, SKatz, JLJoseph, DBBowen, WDNewman, AH 3'-Chloro-3 alpha-(diphenylmethoxy)tropane but not 4'-chloro-3 alpha-(diphenylmethoxy)tropane produces a cocaine-like behavioral profile. J Med Chem 40:851-7 (1997)  
Target
Name:
Sodium-dependent dopamine transporter
Synonyms:
DA transporter SC6A3_RAT Sodium-dependent dopamine transporter | Sodium-dependent dopamine transporter (DAT)
Type:
Multi-pass membrane protein
Mol. Mass.:
68749.45
Organism:
Rattus norvegicus (rat)
Description:
P23977
Residue:
619
  
Inhibitor
Name:
BDBM50454828
Synonyms:
CHEMBL3084907
Type:
Small organic molecule
Emp. Form.:
C21H24FNO
Mol. Mass.:
325.4198
SMILES:
[H][C@]12CC[C@]([H])(C[C@@H](C1)OC(c1ccccc1)c1cccc(F)c1)N2C
: