Target
Sodium-dependent dopamine transporter
Ligand
BDBM50056786
Substrate
Meas. Tech.
ChEMBL_62500 (CHEMBL677557)
Ki
23±n/a nM
Citation
 Xu, LKelkar, SVLomenzo, SAIzenwasser, SKatz, JLKline, RHTrudell, ML Synthesis, dopamine transporter affinity, dopamine uptake inhibition, and locomotor stimulant activity of 2-substituted 3 beta-phenyltropane derivatives. J Med Chem 40:858-63 (1997)  
Target
Name:
Sodium-dependent dopamine transporter
Synonyms:
DA transporter SC6A3_RAT Sodium-dependent dopamine transporter | Sodium-dependent dopamine transporter (DAT)
Type:
Multi-pass membrane protein
Mol. Mass.:
68749.45
Organism:
Rattus norvegicus (rat)
Description:
P23977
Residue:
619
  
Inhibitor
Name:
BDBM50056786
Synonyms:
3-(8-Methyl-3-phenyl-8-aza-bicyclo[3.2.1]oct-2-yl)-propionic acid methyl ester | CHEMBL353860
Type:
Small organic molecule
Emp. Form.:
C18H25NO2
Mol. Mass.:
287.3966
SMILES:
COC(=O)CCC1C2CCC(CC1c1ccccc1)N2C
: