Target
Sodium-dependent dopamine transporter
Ligand
BDBM50056789
Substrate
Meas. Tech.
ChEMBL_62500 (CHEMBL677557)
Ki
16±n/a nM
Citation
 Xu, LKelkar, SVLomenzo, SAIzenwasser, SKatz, JLKline, RHTrudell, ML Synthesis, dopamine transporter affinity, dopamine uptake inhibition, and locomotor stimulant activity of 2-substituted 3 beta-phenyltropane derivatives. J Med Chem 40:858-63 (1997)  
Target
Name:
Sodium-dependent dopamine transporter
Synonyms:
DA transporter SC6A3_RAT Sodium-dependent dopamine transporter | Sodium-dependent dopamine transporter (DAT)
Type:
Multi-pass membrane protein
Mol. Mass.:
68749.45
Organism:
Rattus norvegicus (rat)
Description:
P23977
Residue:
619
  
Inhibitor
Name:
BDBM50056789
Synonyms:
8-Methyl-3-phenyl-2-(3-phenyl-propyl)-8-aza-bicyclo[3.2.1]octane | CHEMBL353307
Type:
Small organic molecule
Emp. Form.:
C23H29N
Mol. Mass.:
319.4831
SMILES:
CN1C2CCC1C(CCCc1ccccc1)C(C2)c1ccccc1
: