Target
Sodium-dependent dopamine transporter
Ligand
BDBM50056790
Substrate
Meas. Tech.
ChEMBL_62500 (CHEMBL677557)
Ki
11±n/a nM
Citation
 Xu, LKelkar, SVLomenzo, SAIzenwasser, SKatz, JLKline, RHTrudell, ML Synthesis, dopamine transporter affinity, dopamine uptake inhibition, and locomotor stimulant activity of 2-substituted 3 beta-phenyltropane derivatives. J Med Chem 40:858-63 (1997)  
Target
Name:
Sodium-dependent dopamine transporter
Synonyms:
DA transporter SC6A3_RAT Sodium-dependent dopamine transporter | Sodium-dependent dopamine transporter (DAT)
Type:
Multi-pass membrane protein
Mol. Mass.:
68749.45
Organism:
Rattus norvegicus (rat)
Description:
P23977
Residue:
619
  
Inhibitor
Name:
BDBM50056790
Synonyms:
3-(8-Methyl-3-phenyl-8-aza-bicyclo[3.2.1]oct-2-yl)-propan-1-ol | CHEMBL354879
Type:
Small organic molecule
Emp. Form.:
C17H25NO
Mol. Mass.:
259.3865
SMILES:
CN1C2CCC1C(CCCO)C(C2)c1ccccc1
: