Target
Gag-Pol polyprotein [489-587]
Ligand
BDBM50065096
Substrate
Meas. Tech.
ChEMBL_157547 (CHEMBL764931)
Ki
103±n/a nM
Citation
 Friedman, SHGanapathi, PSRubin, YKenyon, GL Optimizing the binding of fullerene inhibitors of the HIV-1 protease through predicted increases in hydrophobic desolvation. J Med Chem 41:2424-9 (1998)  
Target
Name:
Gag-Pol polyprotein [489-587]
Synonyms:
Human immunodeficiency virus type 1 protease Pol polyprotein | gag-pol
Type:
Enzyme Subunit
Mol. Mass.:
10781.16
Organism:
Human immunodeficiency virus type 1
Description:
P04585[489-587]
Residue:
99
  
Inhibitor
Name:
BDBM50065096
Synonyms:
CHEMBL409633 | [3'-Phenyl-3'(1-hydroxybenzyl)-1,2-cyclopropano]Buckminster Fullerene
Type:
Small organic molecule
Emp. Form.:
C74H12O
Mol. Mass.:
916.8865
SMILES:
OC(c1ccccc1)C1(c2ccccc2)C23c4c5c6c7c8c9c(c%10c%11c2c2c4c4c%12c5c5c6c6c8c8c%13c9c9c%10c%10c%11c%11c2c2c4c4c%12c%12c5c5c6c8c6c8c%13c9c9c%10c%10c%11c2c2c4c4c%12c5c6c5c8c9c%10c2c45)C137
: