Target
Trehalase
Ligand
BDBM50408431
Substrate
Meas. Tech.
ChEMBL_208279 (CHEMBL813414)
IC50
460000±n/a nM
Citation
 Asano, NNishida, MKato, AKizu, HMatsui, KShimada, YItoh, TBaba, MWatson, AANash, RJLilley, PMWatkin, DJFleet, GW Homonojirimycin isomers and N-alkylated homonojirimycins: structural and conformational basis of inhibition of glycosidases. J Med Chem 41:2565-71 (1998)  
Target
Name:
Trehalase
Synonyms:
Alpha,alpha-trehalase
Type:
PROTEIN
Mol. Mass.:
63480.07
Organism:
Rattus norvegicus
Description:
ChEMBL_208284
Residue:
557
  
Inhibitor
Name:
BDBM50408431
Synonyms:
CHEMBL2114210
Type:
Small organic molecule
Emp. Form.:
C7H15NO5
Mol. Mass.:
193.1977
SMILES:
OC[C@H]1N[C@H](CO)[C@@H](O)C(O)[C@@H]1O
: