Target
Nitric oxide synthase, brain
Ligand
BDBM50065810
Substrate
Meas. Tech.
ChEMBL_143377 (CHEMBL752276)
Ki
>50000±n/a nM
Citation
 Collins, JLShearer, BGOplinger, JALee, SGarvey, EPSalter, MDuffy, CBurnette, TCFurfine, ES N-Phenylamidines as selective inhibitors of human neuronal nitric oxide synthase: structure-activity studies and demonstration of in vivo activity. J Med Chem 41:2858-71 (1998)  
Target
Name:
Nitric oxide synthase, brain
Synonyms:
Constitutive NOS NC-NOS NOS type I nNOS NOS1_HUMAN Neuronal nitric oxide synthase Nitric oxide synthase, neuronal (nNOS) bNOS | nNOS
Type:
Homodimer
Mol. Mass.:
160985.98
Organism:
Homo sapiens (Human)
Description:
P29475
Residue:
1434
  
Inhibitor
Name:
BDBM50065810
Synonyms:
(4-Acetimidoylamino-phenyl)-acetic acid; hydrobromide | CHEMBL555389
Type:
Small organic molecule
Emp. Form.:
C10H12N2O2
Mol. Mass.:
192.2145
SMILES:
CC(N)=Nc1ccc(CC(O)=O)cc1
: