Target
Sodium-dependent dopamine transporter
Ligand
BDBM50062374
Substrate
Meas. Tech.
ChEMBL_61833 (CHEMBL673203)
IC50
28±n/a nM
Citation
 Keverline-Frantz, KIBoja, JWKuhar, MJAbraham, PBurgess, JPLewin, AHCarroll, FI Synthesis and ligand binding of tropane ring analogues of paroxetine. J Med Chem 41:247-57 (1998)  
Target
Name:
Sodium-dependent dopamine transporter
Synonyms:
DA transporter SC6A3_RAT Sodium-dependent dopamine transporter | Sodium-dependent dopamine transporter (DAT)
Type:
Multi-pass membrane protein
Mol. Mass.:
68749.45
Organism:
Rattus norvegicus (rat)
Description:
P23977
Residue:
619
  
Inhibitor
Name:
BDBM50062374
Synonyms:
(2R,3R,8R)-2-(Benzo[1,3]dioxol-5-yloxymethyl)-3-(4-fluoro-phenyl)-8-aza-bicyclo[3.2.1]octane | CHEMBL312977
Type:
Small organic molecule
Emp. Form.:
C21H22FNO3
Mol. Mass.:
355.4027
SMILES:
Fc1ccc(cc1)[C@@H]1CC2CCC(N2)[C@@H]1COc1ccc2OCOc2c1
: