Target
Integrase
Ligand
BDBM50067028
Substrate
Meas. Tech.
ChEMBL_90571 (CHEMBL702428)
IC50
37000±n/a nM
Citation
 Artico, MDi Santo, RCosti, RNovellino, EGreco, GMassa, STramontano, EMarongiu, MEDe Montis, ALa Colla, P Geometrically and conformationally restrained cinnamoyl compounds as inhibitors of HIV-1 integrase: synthesis, biological evaluation, and molecular modeling. J Med Chem 41:3948-60 (1998)  
Target
Name:
Integrase
Synonyms:
Human immunodeficiency virus type 1 integrase
Type:
PROTEIN
Mol. Mass.:
32231.48
Organism:
Human immunodeficiency virus 1
Description:
ChEMBL_90865
Residue:
288
  
Inhibitor
Name:
BDBM50067028
Synonyms:
(1E,4E)-1,5-Bis-(4-hydroxy-3-methoxy-phenyl)-penta-1,4-dien-3-one 1,5-Bis(4-hydroxy-3-methoxyphenyl)penta-1,4-dien-3-one 1,5-bis-(4-hydroxy-3-methoxyphenyl)-penta-1,4-dien-3-one Go-Y022
Type:
Small organic molecule
Emp. Form.:
C19H18O5
Mol. Mass.:
326.3432
SMILES:
COc1cc(\C=C\C(=O)\C=C\c2ccc(O)c(OC)c2)ccc1O
: