Target
B2 bradykinin receptor
Ligand
BDBM50067932
Substrate
Meas. Tech.
ChEMBL_40274 (CHEMBL656509)
IC50
0.550±n/a nM
Citation
 Abe, YKayakiri, HSatoh, SInoue, TSawada, YInamura, NAsano, MAramori, IHatori, CSawai, HOku, TTanaka, H A novel class of orally active non-peptide bradykinin B2 receptor antagonists. 4. Discovery of novel frameworks mimicking the active conformation. J Med Chem 41:4587-98 (1998)  
Target
Name:
B2 bradykinin receptor
Synonyms:
B2 BRADYKININ B2R BK-2 receptor BKRB2_HUMAN | Bradykinin B2 receptor
Type:
Enzyme Catalytic Domain
Mol. Mass.:
44467.17
Organism:
Homo sapiens (Human)
Description:
B2 BRADYKININ BDKRB2 HUMAN::P30411
Residue:
391
  
Inhibitor
Name:
BDBM50067932
Synonyms:
(E)-N-({Methyl-[3-(2-methyl-quinolin-8-yloxymethyl)-2,4-bis-(2-oxo-pyrrolidin-1-yl)-phenyl]-carbamoyl}-methyl)-3-[4-(2-oxo-pyrrolidin-1-yl)-phenyl]-acrylamide; hydrochloride | CHEMBL543685
Type:
Small organic molecule
Emp. Form.:
C41H42N6O6
Mol. Mass.:
714.8088
SMILES:
CN(C(=O)CNC(=O)\C=C\c1ccc(cc1)N1CCCC1=O)c1ccc(N2CCCC2=O)c(COc2cccc3ccc(C)nc23)c1N1CCCC1=O
: