Target
Serine protease 1/Trypsin-2
Ligand
BDBM50068484
Substrate
Meas. Tech.
ChEMBL_212686 (CHEMBL815471)
Ki
10000±n/a nM
Citation
 Kucznierz, RGrams, FLeinert, HMarzenell, KEngh, RAvon der Saal, W Tetrahydro-isoquinoline-based factor Xa inhibitors. J Med Chem 41:4983-94 (1999)  
Target
Name:
Serine protease 1/Trypsin-2
Synonyms:
Trypsin II
Type:
Mol. Mass.:
Description:
ASSAY_ID of EBI is 212335
Components:
This complex has 2 components.
Component 1
Name:
Serine protease 1
Synonyms:
Alpha-trypsin chain 1 Beta-trypsin PRSS1 TRP1 TRY1_HUMAN Thrombin & trypsin Trypsin I | Trypsin-1
Type:
Enzyme
Mol. Mass.:
26557.80
Organism:
Homo sapiens (Human)
Description:
P07477
Residue:
247
  
Component 2
Name:
Trypsin-2
Synonyms:
Anionic trypsinogen Serine protease 2 TRY2_HUMAN Thrombin & trypsin Trypsin II | Trypsin-2
Type:
PROTEIN
Mol. Mass.:
26479.43
Organism:
Homo sapiens (Human)
Description:
ChEMBL_41517
Residue:
247
  
Inhibitor
Name:
BDBM50068484
Synonyms:
(2-Carbamimidoyl-1,2,3,4-tetrahydro-isoquinolin-7-yloxy)-{4-[(S)-1-(5,5-dimethyl-3-oxo-cyclohex-1-enyl)-pyrrolidin-3-yloxy]-phenyl}-acetic acid ethyl ester | CHEMBL356973
Type:
Small organic molecule
Emp. Form.:
C32H40N4O5
Mol. Mass.:
560.6838
SMILES:
CCOC(=O)C(Oc1ccc2CCN(Cc2c1)C(N)=N)c1ccc(O[C@H]2CCN(C2)C2=CC(=O)CC(C)(C)C2)cc1
: