Target
Prothrombin
Ligand
BDBM50068505
Substrate
Meas. Tech.
ChEMBL_208547 (CHEMBL814316)
Ki
>100000±n/a nM
Citation
 Kucznierz, RGrams, FLeinert, HMarzenell, KEngh, RAvon der Saal, W Tetrahydro-isoquinoline-based factor Xa inhibitors. J Med Chem 41:4983-94 (1999)  
Target
Name:
Prothrombin
Synonyms:
Activation peptide fragment 1 Coagulation factor II Prothrombin precursor Thrombin heavy chain | Thrombin light chain
Type:
Protein
Mol. Mass.:
70029.57
Organism:
Homo sapiens (Human)
Description:
P00734
Residue:
622
  
Inhibitor
Name:
BDBM50068505
Synonyms:
(2-Carbamimidoyl-1,2,3,4-tetrahydro-isoquinolin-7-yloxy)-[4-((S)-pyrrolidin-3-yloxy)-phenyl]-acetic acid ethyl ester | CHEMBL144079
Type:
Small organic molecule
Emp. Form.:
C24H30N4O4
Mol. Mass.:
438.5194
SMILES:
CCOC(=O)C(Oc1ccc2CCN(Cc2c1)C(N)=N)c1ccc(O[C@H]2CCNC2)cc1
: