Target
Reverse transcriptase/RNaseH
Ligand
BDBM50369418
Substrate
Meas. Tech.
ChEMBL_195058 (CHEMBL797513)
IC50
4300±n/a nM
Citation
 Smith, RHJorgensen, WLTirado-Rives, JLamb, MLJanssen, PAMichejda, CJKroeger Smith, MB Prediction of binding affinities for TIBO inhibitors of HIV-1 reverse transcriptase using Monte Carlo simulations in a linear response method. J Med Chem 41:5272-86 (1999)  
Target
Name:
Reverse transcriptase/RNaseH
Synonyms:
HIV-1 Reverse Transcriptase RNase H Reverse transcriptase/RNaseH
Type:
PROTEIN
Mol. Mass.:
65229.15
Organism:
Human immunodeficiency virus 1
Description:
ChEMBL_1473730
Residue:
566
  
Inhibitor
Name:
BDBM50369418
Synonyms:
CHEMBL58711 | R-87027
Type:
Small organic molecule
Emp. Form.:
C16H20ClN3S
Mol. Mass.:
321.868
SMILES:
C[C@H]1Cn2c3c(CN1CC=C(C)C)c(Cl)ccc3[nH]c2=S
: