Target
Prothrombin
Ligand
BDBM50062628
Substrate
Meas. Tech.
ChEMBL_208889 (CHEMBL814946)
Ki
3±n/a nM
Citation
 Brady, SFStauffer, KJLumma, WCSmith, GMRamjit, HGLewis, SDLucas, BJGardell, SJLyle, EAAppleby, SDCook, JJHolahan, MAStranieri, MTLynch, JJLin, JHChen, IWVastag, KNaylor-Olsen, AMVacca, JP Discovery and development of the novel potent orally active thrombin inhibitor N-(9-hydroxy-9-fluorenecarboxy)prolyl trans-4-aminocyclohexylmethyl amide (L-372,460): coapplication of structure-based design and rapid multiple analogue synthesis on solid support. J Med Chem 41:401-6 (1998)  
Target
Name:
Prothrombin
Synonyms:
Activation peptide fragment 1 Coagulation factor II Prothrombin precursor Thrombin heavy chain | Thrombin light chain
Type:
Protein
Mol. Mass.:
70029.57
Organism:
Homo sapiens (Human)
Description:
P00734
Residue:
622
  
Inhibitor
Name:
BDBM50062628
Synonyms:
(S)-1-((S)-2-Amino-2-cyclohexyl-acetyl)-pyrrolidine-2-carboxylic acid (4-amino-cyclohexylmethyl)-amide | CHEMBL130119
Type:
Small organic molecule
Emp. Form.:
C20H36N4O2
Mol. Mass.:
364.5254
SMILES:
N[C@@H](C1CCCCC1)C(=O)N1CCC[C@H]1C(=O)NCC1CCC(N)CC1
: