Target
Aldo-keto reductase family 1 member B1 [K65Q]
Ligand
BDBM50077323
Substrate
Meas. Tech.
ChEMBL_31467 (CHEMBL647989)
IC50
13630±n/a nM
Citation
 Costantino, LRastelli, GGamberini, MCVinson, JABose, PIannone, AStaffieri, MAntolini, LDel Corso, AMura, UAlbasini, A 1-Benzopyran-4-one antioxidants as aldose reductase inhibitors. J Med Chem 42:1881-93 (1999)  
Target
Name:
Aldo-keto reductase family 1 member B1 [K65Q]
Synonyms:
AKR1B1 Aldose reductase
Type:
Protein
Mol. Mass.:
35916.27
Organism:
Bos taurus (Cattle)
Description:
P16116[K65Q]
Residue:
315
  
Inhibitor
Name:
BDBM50077323
Synonyms:
7,4'-Dihydroxyflavone CHEMBL294878
Type:
Small organic molecule
Emp. Form.:
C15H10O4
Mol. Mass.:
254.2375
SMILES:
Oc1ccc(cc1)-c1cc(=O)c2ccc(O)cc2o1
: