Target
Aldo-keto reductase family 1 member B1 [K65Q]
Ligand
BDBM50077314
Substrate
Meas. Tech.
ChEMBL_31466 (CHEMBL647988)
IC50
13230±n/a nM
Citation
 Costantino, LRastelli, GGamberini, MCVinson, JABose, PIannone, AStaffieri, MAntolini, LDel Corso, AMura, UAlbasini, A 1-Benzopyran-4-one antioxidants as aldose reductase inhibitors. J Med Chem 42:1881-93 (1999)  
Target
Name:
Aldo-keto reductase family 1 member B1 [K65Q]
Synonyms:
AKR1B1 Aldose reductase
Type:
Protein
Mol. Mass.:
35916.27
Organism:
Bos taurus (Cattle)
Description:
P16116[K65Q]
Residue:
315
  
Inhibitor
Name:
BDBM50077314
Synonyms:
2-(3,4-Dihydroxy-benzyl)-7-hydroxy-chromen-4-one | CHEMBL56890
Type:
Small organic molecule
Emp. Form.:
C16H12O5
Mol. Mass.:
284.2635
SMILES:
Oc1ccc2c(c1)oc(Cc1ccc(O)c(O)c1)cc2=O
: