Target
Aldo-keto reductase family 1 member B1 [K65Q]
Ligand
BDBM50077312
Substrate
Meas. Tech.
ChEMBL_32265 (CHEMBL645599)
IC50
10890±n/a nM
Citation
 Costantino, LRastelli, GGamberini, MCVinson, JABose, PIannone, AStaffieri, MAntolini, LDel Corso, AMura, UAlbasini, A 1-Benzopyran-4-one antioxidants as aldose reductase inhibitors. J Med Chem 42:1881-93 (1999)  
Target
Name:
Aldo-keto reductase family 1 member B1 [K65Q]
Synonyms:
AKR1B1 Aldose reductase
Type:
Protein
Mol. Mass.:
35916.27
Organism:
Bos taurus (Cattle)
Description:
P16116[K65Q]
Residue:
315
  
Inhibitor
Name:
BDBM50077312
Synonyms:
2-(4-Hydroxy-benzyl)-4-oxo-4H-chromene-7-carboxylic acid | CHEMBL55446
Type:
Small organic molecule
Emp. Form.:
C17H12O5
Mol. Mass.:
296.2742
SMILES:
OC(=O)c1ccc2c(c1)oc(Cc1ccc(O)cc1)cc2=O
: