Target
Aldo-keto reductase family 1 member B1 [K65Q]
Ligand
BDBM50077324
Substrate
Meas. Tech.
ChEMBL_32265 (CHEMBL645599)
IC50
10890±n/a nM
Citation
 Costantino, LRastelli, GGamberini, MCVinson, JABose, PIannone, AStaffieri, MAntolini, LDel Corso, AMura, UAlbasini, A 1-Benzopyran-4-one antioxidants as aldose reductase inhibitors. J Med Chem 42:1881-93 (1999)  
Target
Name:
Aldo-keto reductase family 1 member B1 [K65Q]
Synonyms:
AKR1B1 Aldose reductase
Type:
Protein
Mol. Mass.:
35916.27
Organism:
Bos taurus (Cattle)
Description:
P16116[K65Q]
Residue:
315
  
Inhibitor
Name:
BDBM50077324
Synonyms:
2-Benzhydryl-7-hydroxy-chromen-4-one | CHEMBL292697
Type:
Small organic molecule
Emp. Form.:
C22H16O3
Mol. Mass.:
328.3606
SMILES:
Oc1ccc2c(c1)oc(cc2=O)C(c1ccccc1)c1ccccc1
: