Target
Alpha-1B adrenergic receptor
Ligand
BDBM50082795
Substrate
Meas. Tech.
ChEMBL_34457 (CHEMBL651989)
Ki
77±n/a nM
Citation
 Nagarathnam, DMiao, SWLagu, BChiu, GFang, JMurali Dhar, TGZhang, JTyagarajan, SMarzabadi, MRZhang, FWong, WCSun, WTian, DWetzel, JMForray, CChang, RSBroten, TPRansom, RWSchorn, TWChen, TBO'Malley, SKling, PSchneck, KBendesky, RHarrell, CM Design and synthesis of novel alpha(1)(a) adrenoceptor-selective antagonists. 1. Structure-activity relationship in dihydropyrimidinones. J Med Chem 42:4764-77 (1999)  
Target
Name:
Alpha-1B adrenergic receptor
Synonyms:
ADA1B_HUMAN Adrenergic alpha1B Adrenergic receptor alpha Alpha 1B-adrenoreceptor | Alpha-1B adrenergic receptor
Type:
Enzyme
Mol. Mass.:
56862.13
Organism:
Homo sapiens (Human)
Description:
P35368
Residue:
520
  
Inhibitor
Name:
BDBM50082795
Synonyms:
3-[3-(4-Methoxycarbonyl-4-phenyl-piperidin-1-yl)-propylcarbamoyl]-6-methyl-2-oxo-4-p-tolyl-1,2,3,4-tetrahydro-pyrimidine-5-carboxylic acid methyl ester | CHEMBL359173
Type:
Small organic molecule
Emp. Form.:
C31H38N4O6
Mol. Mass.:
562.6566
SMILES:
COC(=O)C1=C(C)NC(=O)N(C1c1ccc(C)cc1)C(=O)NCCCN1CCC(CC1)(C(=O)OC)c1ccccc1
: