Target
Alpha-1D adrenergic receptor
Ligand
BDBM50082796
Substrate
Meas. Tech.
ChEMBL_32451 (CHEMBL643399)
Ki
180±n/a nM
Citation
 Nagarathnam, DMiao, SWLagu, BChiu, GFang, JMurali Dhar, TGZhang, JTyagarajan, SMarzabadi, MRZhang, FWong, WCSun, WTian, DWetzel, JMForray, CChang, RSBroten, TPRansom, RWSchorn, TWChen, TBO'Malley, SKling, PSchneck, KBendesky, RHarrell, CM Design and synthesis of novel alpha(1)(a) adrenoceptor-selective antagonists. 1. Structure-activity relationship in dihydropyrimidinones. J Med Chem 42:4764-77 (1999)  
Target
Name:
Alpha-1D adrenergic receptor
Synonyms:
ADA1D_HUMAN ADRA1D Adrenergic receptor alpha Alpha 1D-adrenoreceptor Alpha-1D adrenoceptor adrenergic Alpha1D
Type:
Enzyme Catalytic Domain
Mol. Mass.:
60485.82
Organism:
Homo sapiens (Human)
Description:
adrenergic Alpha1D ADRA1D HUMAN::P25100
Residue:
572
  
Inhibitor
Name:
BDBM50082796
Synonyms:
4-(3-Chloro-phenyl)-3-[3-(4-methoxycarbonyl-4-phenyl-piperidin-1-yl)-propylcarbamoyl]-6-methyl-2-oxo-1,2,3,4-tetrahydro-pyrimidine-5-carboxylic acid methyl ester | CHEMBL143066
Type:
Small organic molecule
Emp. Form.:
C30H35ClN4O6
Mol. Mass.:
583.075
SMILES:
COC(=O)C1=C(C)NC(=O)N(C1c1cccc(Cl)c1)C(=O)NCCCN1CCC(CC1)(C(=O)OC)c1ccccc1
: