Target
Alpha-1A adrenergic receptor
Ligand
BDBM50082800
Substrate
Meas. Tech.
ChEMBL_33739 (CHEMBL873186)
Ki
2.1±n/a nM
Citation
 Nagarathnam, DMiao, SWLagu, BChiu, GFang, JMurali Dhar, TGZhang, JTyagarajan, SMarzabadi, MRZhang, FWong, WCSun, WTian, DWetzel, JMForray, CChang, RSBroten, TPRansom, RWSchorn, TWChen, TBO'Malley, SKling, PSchneck, KBendesky, RHarrell, CM Design and synthesis of novel alpha(1)(a) adrenoceptor-selective antagonists. 1. Structure-activity relationship in dihydropyrimidinones. J Med Chem 42:4764-77 (1999)  
Target
Name:
Alpha-1A adrenergic receptor
Synonyms:
ADA1A_HUMAN ADRA1C Alpha 1A-adrenoceptor Alpha adrenergic receptor 1a Alpha-adrenergic receptor 1c adrenergic Alpha1 | adrenergic Alpha1C
Type:
Cell-surface receptors
Mol. Mass.:
51511.67
Organism:
Homo sapiens (Human)
Description:
P35348
Residue:
466
  
Inhibitor
Name:
BDBM50082800
Synonyms:
1-(3-{[4-Methyl-5-methylcarbamoyl-6-(4-nitro-phenyl)-2-oxo-3,6-dihydro-2H-pyrimidine-1-carbonyl]-amino}-propyl)-4-phenyl-piperidine-4-carboxylic acid methyl ester | CHEMBL145334
Type:
Small organic molecule
Emp. Form.:
C30H36N6O7
Mol. Mass.:
592.6428
SMILES:
CNC(=O)C1=C(C)NC(=O)N(C1c1ccc(cc1)[N+]([O-])=O)C(=O)NCCCN1CCC(CC1)(C(=O)OC)c1ccccc1
: