Target
Alpha-1D adrenergic receptor
Ligand
BDBM50082864
Substrate
Meas. Tech.
ChEMBL_32430 (CHEMBL646092)
Ki
1900±n/a nM
Citation
 Wong, WCSun, WLagu, BTian, DMarzabadi, MRZhang, FNagarathnam, DMiao, SWWetzel, JMPeng, JForray, CChang, RSChen, TBRansom, RO'Malley, SBroten, TPKling, PVyas, KPZhang, KGluchowski, C Design and synthesis of novel alpha(1)(a) adrenoceptor-selective antagonists. 4. Structure-activity relationship in the dihydropyrimidine series. J Med Chem 42:4804-13 (1999)  
Target
Name:
Alpha-1D adrenergic receptor
Synonyms:
ADA1D_HUMAN ADRA1D Adrenergic receptor alpha Alpha 1D-adrenoreceptor Alpha-1D adrenoceptor adrenergic Alpha1D
Type:
Enzyme Catalytic Domain
Mol. Mass.:
60485.82
Organism:
Homo sapiens (Human)
Description:
adrenergic Alpha1D ADRA1D HUMAN::P25100
Residue:
572
  
Inhibitor
Name:
BDBM50082864
Synonyms:
1-{5-[6-(2,4-Difluoro-phenyl)-2,4-dimethyl-5-methylcarbamoyl-6H-pyrimidin-1-yl]-pentyl}-4-phenyl-piperidine-4-carboxylic acid methyl ester | CHEMBL142719
Type:
Small organic molecule
Emp. Form.:
C32H40F2N4O3
Mol. Mass.:
566.6818
SMILES:
CNC(=O)C1=C(C)N=C(C)N(CCCCCN2CCC(CC2)(C(=O)OC)c2ccccc2)C1c1ccc(F)cc1F
: