Target
Muscarinic acetylcholine receptor M5
Ligand
BDBM50073476
Substrate
Meas. Tech.
ChEMBL_139388 (CHEMBL747701)
IC50
159±n/a nM
Citation
 Augelli-Szafran, CEBlankley, CJJaen, JCMoreland, DWNelson, CBPenvose-Yi, JRSchwarz, RDThomas, AJ Identification and characterization of m1 selective muscarinic receptor antagonists1. J Med Chem 42:356-63 (1999)  
Target
Name:
Muscarinic acetylcholine receptor M5
Synonyms:
ACM5_HUMAN | CHRM5
Type:
PROTEIN
Mol. Mass.:
60102.35
Organism:
Homo sapiens (Human)
Description:
ChEMBL_1517990
Residue:
532
  
Inhibitor
Name:
BDBM50073476
Synonyms:
1-Ethyl-4-phenyl-1,2,3,6-tetrahydro-pyridine-3-carboxylic acid 2-cyclohexyl-ethyl ester; oxalic acid | CHEMBL120599
Type:
Small organic molecule
Emp. Form.:
C22H31NO2
Mol. Mass.:
341.487
SMILES:
CCN1CC=C(C(C1)C(=O)OCCC1CCCCC1)c1ccccc1
: