Target
Muscarinic acetylcholine receptor M2
Ligand
BDBM50073471
Substrate
Meas. Tech.
ChEMBL_139631 (CHEMBL748244)
IC50
1222±n/a nM
Citation
 Augelli-Szafran, CEBlankley, CJJaen, JCMoreland, DWNelson, CBPenvose-Yi, JRSchwarz, RDThomas, AJ Identification and characterization of m1 selective muscarinic receptor antagonists1. J Med Chem 42:356-63 (1999)  
Target
Name:
Muscarinic acetylcholine receptor M2
Synonyms:
ACM2_HUMAN Cholinergic, muscarinic M2 Muscarinic acetylcholine receptor M2 and M5 | RecName: Full=Muscarinic acetylcholine receptor M2
Type:
GPCR
Mol. Mass.:
51730.61
Organism:
Homo sapiens (Human)
Description:
P08172
Residue:
466
  
Inhibitor
Name:
BDBM50073471
Synonyms:
1-Ethyl-5-(3-pentyl-[1,2,4]oxadiazol-5-yl)-4-phenyl-1,2,3,6-tetrahydro-pyridine; oxalic acid | CHEMBL431688
Type:
Small organic molecule
Emp. Form.:
C20H27N3O
Mol. Mass.:
325.4479
SMILES:
CCCCCc1noc(n1)C1=C(CCN(CC)C1)c1ccccc1
: