Target
Muscarinic acetylcholine receptor M4
Ligand
BDBM50073476
Substrate
Meas. Tech.
ChEMBL_139113 (CHEMBL749237)
IC50
836±n/a nM
Citation
 Augelli-Szafran, CEBlankley, CJJaen, JCMoreland, DWNelson, CBPenvose-Yi, JRSchwarz, RDThomas, AJ Identification and characterization of m1 selective muscarinic receptor antagonists1. J Med Chem 42:356-63 (1999)  
Target
Name:
Muscarinic acetylcholine receptor M4
Synonyms:
ACM4_HUMAN Cholinergic, muscarinic M4 Muscarinic acetylcholine receptor M2 and M4
Type:
Enzyme Catalytic Domain
Mol. Mass.:
53079.31
Organism:
Homo sapiens (Human)
Description:
Cholinergic, muscarinic M4 CHRM4 HUMAN M3::P08173
Residue:
479
  
Inhibitor
Name:
BDBM50073476
Synonyms:
1-Ethyl-4-phenyl-1,2,3,6-tetrahydro-pyridine-3-carboxylic acid 2-cyclohexyl-ethyl ester; oxalic acid | CHEMBL120599
Type:
Small organic molecule
Emp. Form.:
C22H31NO2
Mol. Mass.:
341.487
SMILES:
CCN1CC=C(C(C1)C(=O)OCCC1CCCCC1)c1ccccc1
: