Target
Acetylcholinesterase
Ligand
BDBM50074273
Substrate
Meas. Tech.
ChEMBL_29229 (CHEMBL641395)
IC50
70000±n/a nM
Citation
 Contreras, JMRival, YMChayer, SBourguignon, JJWermuth, CG Aminopyridazines as acetylcholinesterase inhibitors. J Med Chem 42:730-41 (1999)  
Target
Name:
Acetylcholinesterase
Synonyms:
ACES_RAT Acetylcholinesterase and butyrylcholinesterase (AChE and BChE) Acetylcholinesterase, AChE | Ache
Type:
Enzyme
Mol. Mass.:
68193.62
Organism:
Rattus norvegicus (rat)
Description:
P37136
Residue:
614
  
Inhibitor
Name:
BDBM50074273
Synonyms:
(5-Phenyl-pyridin-2-yl)-(2-piperidin-1-yl-ethyl)-amine | CHEMBL351647
Type:
Small organic molecule
Emp. Form.:
C18H23N3
Mol. Mass.:
281.3953
SMILES:
C(CN1CCCCC1)Nc1ccc(cn1)-c1ccccc1
: