Target
Matrilysin
Ligand
BDBM50369525
Substrate
Meas. Tech.
ChEMBL_105035 (CHEMBL711549)
IC50
2100±n/a nM
Citation
 Apfel, CBanner, DWBur, DDietz, MHirata, THubschwerlen, CLocher, HPage, MGPirson, WRossé, GSpecklin, JL Hydroxamic acid derivatives as potent peptide deformylase inhibitors and antibacterial agents. J Med Chem 43:2324-31 (2000)  
Target
Name:
Matrilysin
Synonyms:
MMP7 MPSL1 Matrix metalloproteinase-7 (MMP-7) PUMP1
Type:
Enzyme
Mol. Mass.:
29681.54
Organism:
Homo sapiens (Human)
Description:
P09237
Residue:
267
  
Inhibitor
Name:
BDBM50369525
Synonyms:
CHEMBL1788203
Type:
Small organic molecule
Emp. Form.:
C13H19NO4S
Mol. Mass.:
285.359
SMILES:
CCCC[C@H](CC(=O)NO)S(=O)(=O)c1ccccc1
: