Target
Metabotropic glutamate receptor 7
Ligand
BDBM50089890
Substrate
Meas. Tech.
ChEMBL_104479 (CHEMBL712461)
Ki
>100000±n/a nM
Citation
 Bräuner-Osborne, HEgebjerg, JNielsen, EOMadsen, UKrogsgaard-Larsen, P Ligands for glutamate receptors: design and therapeutic prospects. J Med Chem 43:2609-45 (2000)  
Target
Name:
Metabotropic glutamate receptor 7
Synonyms:
GPRC1G GRM7 protein MGLUR7 metabotropic glutamate 7
Type:
Enzyme Catalytic Domain
Mol. Mass.:
102262.98
Organism:
Homo sapiens (Human)
Description:
Q14831
Residue:
915
  
Inhibitor
Name:
BDBM50089890
Synonyms:
4-Amino-2-oxa-bicyclo[3.1.0]hexane-4,6-dicarboxylic acid(LY379268) | CHEMBL89000
Type:
Small organic molecule
Emp. Form.:
C7H9NO5
Mol. Mass.:
187.1501
SMILES:
N[C@]1(COC2[C@@H](C12)C(O)=O)C(O)=O
: