Target
Metabotropic glutamate receptor 1
Ligand
BDBM50069111
Substrate
Meas. Tech.
ChEMBL_105708 (CHEMBL719076)
Ki
>300000±n/a nM
Citation
 Bräuner-Osborne, HEgebjerg, JNielsen, EOMadsen, UKrogsgaard-Larsen, P Ligands for glutamate receptors: design and therapeutic prospects. J Med Chem 43:2609-45 (2000)  
Target
Name:
Metabotropic glutamate receptor 1
Synonyms:
GPRC1A GRM1_HUMAN Metabotropic Glutamate 1a | metabotropic glutamate 1
Type:
Enzyme
Mol. Mass.:
132358.19
Organism:
Homo sapiens (Human)
Description:
Q13255
Residue:
1194
  
Inhibitor
Name:
BDBM50069111
Synonyms:
(2S,4S)-2-Amino-4-(2,2-diphenyl-ethyl)-pentanedioic acid CHEMBL40123
Type:
Small organic molecule
Emp. Form.:
C19H21NO4
Mol. Mass.:
327.3743
SMILES:
N[C@@H](C[C@H](CC(c1ccccc1)c1ccccc1)C(O)=O)C(O)=O
: