Target
Metabotropic glutamate receptor 6
Ligand
BDBM50089893
Substrate
Meas. Tech.
ChEMBL_104311 (CHEMBL718130)
Ki
>1000000±n/a nM
Citation
 Bräuner-Osborne, HEgebjerg, JNielsen, EOMadsen, UKrogsgaard-Larsen, P Ligands for glutamate receptors: design and therapeutic prospects. J Med Chem 43:2609-45 (2000)  
Target
Name:
Metabotropic glutamate receptor 6
Synonyms:
GPRC1F GRM6_HUMAN Metabotropic glutamate receptor 6 metabotropic glutamate 6
Type:
Enzyme Catalytic Domain
Mol. Mass.:
95479.26
Organism:
Homo sapiens (Human)
Description:
metabotropic glutamate 6 GRM6 HUMAN::O15303
Residue:
877
  
Inhibitor
Name:
BDBM50089893
Synonyms:
1-Amino-5-phosphono-indan-1-carboxylic acid CHEMBL277961
Type:
Small organic molecule
Emp. Form.:
C10H12NO5P
Mol. Mass.:
257.1797
SMILES:
NC1(CCc2cc(ccc12)P(O)(O)=O)C(O)=O
: