Target
Metabotropic glutamate receptor 7
Ligand
BDBM50034504
Substrate
Meas. Tech.
ChEMBL_104479 (CHEMBL712461)
Ki
230000±n/a nM
Citation
 Bräuner-Osborne, HEgebjerg, JNielsen, EOMadsen, UKrogsgaard-Larsen, P Ligands for glutamate receptors: design and therapeutic prospects. J Med Chem 43:2609-45 (2000)  
Target
Name:
Metabotropic glutamate receptor 7
Synonyms:
GPRC1G GRM7 protein MGLUR7 metabotropic glutamate 7
Type:
Enzyme Catalytic Domain
Mol. Mass.:
102262.98
Organism:
Homo sapiens (Human)
Description:
Q14831
Residue:
915
  
Inhibitor
Name:
BDBM50034504
Synonyms:
(1S,2S)-2-((S)-Amino-carboxy-methyl)-cyclopropanecarboxylic acid 2-(Amino-carboxy-methyl)-cyclopropanecarboxylic acid(2S,3S,4S-CCG) L-CCGI
Type:
Small organic molecule
Emp. Form.:
C6H9NO4
Mol. Mass.:
159.14
SMILES:
N[C@@H]([C@H]1C[C@@H]1C(O)=O)C(O)=O
: