Target
Metabotropic glutamate receptor 3
Ligand
BDBM50034504
Substrate
Meas. Tech.
ChEMBL_106383 (CHEMBL717238)
Ki
440±n/a nM
Citation
 Bräuner-Osborne, HEgebjerg, JNielsen, EOMadsen, UKrogsgaard-Larsen, P Ligands for glutamate receptors: design and therapeutic prospects. J Med Chem 43:2609-45 (2000)  
Target
Name:
Metabotropic glutamate receptor 3
Synonyms:
GPRC1C GRM3_HUMAN metabotropic glutamate 3 metabotropic glutamate 3/1c
Type:
Enzyme Catalytic Domain
Mol. Mass.:
98889.09
Organism:
Homo sapiens (Human)
Description:
metabotropic glutamate 1c 0 HUMAN::Q14832
Residue:
879
  
Inhibitor
Name:
BDBM50034504
Synonyms:
(1S,2S)-2-((S)-Amino-carboxy-methyl)-cyclopropanecarboxylic acid 2-(Amino-carboxy-methyl)-cyclopropanecarboxylic acid(2S,3S,4S-CCG) L-CCGI
Type:
Small organic molecule
Emp. Form.:
C6H9NO4
Mol. Mass.:
159.14
SMILES:
N[C@@H]([C@H]1C[C@@H]1C(O)=O)C(O)=O
: